{"text_format":"1","workbook":"xlsx","n_sheets":3,"sheets":["Inserimento dati","Liquidazione","Tabelle"],"not_rendered":{"charts":0,"images":0,"macros":1,"external_links":0,"defined_names":3,"comments":0,"pivot_tables":0},"unopened":[],"bounds":{"document_bytes":16777216,"sheet_cells":100000,"rows_first":2000,"rows_last":500,"rows_between":2000,"halvings":0,"cell_chars":16384,"cell_head_chars":4096},"cells_cut":0,"cells_raw":0,"read":"whole","date_system":"1900"}

{"sheet":"Inserimento dati","index":0,"n_rows":40,"n_cols":49,"rows_kept":40,"cut":false,"hidden":false,"merged":[[2,7,2,9],[3,8,3,10],[9,8,9,10],[9,5,9,6],[3,5,3,6],[7,5,7,6],[7,8,7,10]]}
[]
[null,"PROCEDURA"]
[]
[null,null,"Procedura Nr.",null,"Anno",null,null,"Giudice"]
[null,null,null,null,null,null,null,null,null,null,null,null,"Versione 3.0"]
[null,"CUSTODE"]
[]
[null,null,"Prof.Delegato",null,"Nome",null,null,"Cognome"]
[]
[null,null,null,null,"Cod. Fiscale",null,null,"e-mail"]
[]
[null,"FRUTTI CIVILI E RIMBORSO DELLE SPESE"]
[null,null,"Spese",null,"Spese non",null,"Frutti civili"]
[null,null,"imponibili",null,"imponibili",null,"percepiti",null,"Attenzione allegare la documentazione giustificativa delle spese"]
[]
[null,"RIFERIMENTI D.M. 80/2009",null,null,null,null,null,null,null,null,{"$f":"CONCATENATE(\"Procedura \",D4,\"/\",F4)","v":"Procedura /"}]
[null,null,null,"Immobile libero o incarico di ridotta complessità ","Eccezionali difficoltà nello svolgimento dell'incarico espressamente indicate","Cessazione dell'incarico, inefficacia del pignoramento, sospensione o estinzione del processo prima della emissione dell'ordinanza di vendita","Inizio dell'incarico dalla emissione della ordinanza di vendita","Cessazione dell'incarico, inefficacia del pignoramento, sospensione o estinzione del processo prima della vendita","Azioni per la convalida della licenza o dello sfratto per finita locazione o per morosita' e promozione di ogni altra azione, anche esecutiva, occorrente per conseguire la disponibilità del bene","Partecipazione alle assemblee condominiali","Interventi di manutenzione ordinaria o straordinaria","Regolarizzazione catastale, urbanistica ed edilizia degli immobili","Direzione e controllo delle attivita' di asporto e trasferimento presso un depositario delle cose mobili appartenenti al debitore o a terzi rinvenute nell'immobile pignorato","Attuazione dell'ordine di liberazione",null,null,"A min","A med","A max","B min","B med","B max","C min","C med","C max","D min","D med","D max","E min","E med","E max","F min","F med","F max","G min","G med","G max","H min","H med","H max","I min","I med","I max","L min","L med","L max","M min","M med","M max"]
[null,"Lotto","Valore","Art.2","Art.2","Art.2","Art.2","Art.2","Art.3","Art.3","Art.3","Art.3","Art.3","Art.3",null,null,null,null,{"$f":"IF(Y20=0,IF(AB20=0,\"X\",\"\"),\"\")","v":"X"}]
[null,null,null,"comma 4","comma 5","comma 3",null,"comma 3","c. 2, lett. a)","c. 2, lett. b)","c. 2, lett. c) ","c. 2, lett. d) ","c. 2, lett. e) ","c. lett. e) bis"]
[null,"Lotto 01",null,null,null,null,null,null,null,null,null,null,null,null,null,{"$f":"IF(C20>0,IF((C20-VLOOKUP(C20,Tabelle!$B$9:$E$14,1,TRUE))*VLOOKUP(C20,Tabelle!$B$9:$E$14,3,TRUE)+VLOOKUP(C20,Tabelle!$B$9:$E$14,4,TRUE)>250,(C20-VLOOKUP(C20,Tabelle!$B$9:$E$14,1,TRUE))*VLOOKUP(C20,Tabelle!$B$9:$E$14,3,TRUE)+VLOOKUP(C20,Tabelle!$B$9:$E$14,4,TRUE),250),0)","v":0},{"$f":"IF(Z20=0,IF(W20=0,IF(D20=\"X\",P20*-Liquidazione!$N$37,0),0),0)","v":0},{"$f":"IF(X20=0,IF(AA20=0,IF(D20=\"X\",P20*-Liquidazione!$N$38,0),0),0)","v":0},{"$f":"IF(Y20=0,IF(AB20=0,IF(D20=\"X\",P20*-Liquidazione!$N$39,0),0),0)","v":0},{"$f":"IF(E20=\"X\",P20*Liquidazione!$O$37,0)","v":0},{"$f":"IF(E20=\"X\",P20*Liquidazione!$O$38,0)","v":0},{"$f":"IF(E20=\"X\",P20*Liquidazione!$O$39,0)","v":0},{"$f":"IF(F20=\"X\",P20*-Liquidazione!$P$37,0)","v":0},{"$f":"IF(F20=\"X\",P20*-Liquidazione!$P$38,0)","v":0},{"$f":"IF(F20=\"X\",P20*-Liquidazione!$P$39,0)","v":0},{"$f":"IF(G20=\"X\",P20*-Liquidazione!$Q$37,0)","v":0},{"$f":"IF(G20=\"X\",P20*-Liquidazione!$Q$38,0)","v":0},{"$f":"IF(G20=\"X\",P20*-Liquidazione!$Q$39,0)","v":0},{"$f":"IF(H20=\"X\",P20*-Liquidazione!$R$37,0)","v":0},{"$f":"IF(H20=\"X\",P20*-Liquidazione!$R$38,0)","v":0},{"$f":"IF(H20=\"X\",P20*-Liquidazione!$R$39,0)","v":0},{"$f":"IF(I20=\"X\",P20*Liquidazione!$S$37,0)","v":0},{"$f":"IF(I20=\"X\",P20*Liquidazione!$S$38,0)","v":0},{"$f":"IF(I20=\"X\",P20*Liquidazione!$S$39,0)","v":0},{"$f":"IF(J20=\"X\",P20*Liquidazione!$T$37,0)","v":0},{"$f":"IF(J20=\"X\",P20*Liquidazione!$T$38,0)","v":0},{"$f":"IF(J20=\"X\",P20*Liquidazione!$T$39,0)","v":0},{"$f":"IF(K20=\"X\",P20*Liquidazione!$U$37,0)","v":0},{"$f":"IF(K20=\"X\",P20*Liquidazione!$U$38,0)","v":0},{"$f":"IF(K20=\"X\",P20*Liquidazione!$U$39,0)","v":0},{"$f":"IF(L20=\"X\",P20*Liquidazione!$V$37,0)","v":0},{"$f":"IF(L20=\"X\",P20*Liquidazione!$V$38,0)","v":0},{"$f":"IF(L20=\"X\",P20*Liquidazione!$V$39,0)","v":0},{"$f":"IF(M20=\"X\",P20*Liquidazione!$W$37,0)","v":0},{"$f":"IF(M20=\"X\",P20*Liquidazione!$W$38,0)","v":0},{"$f":"IF(M20=\"X\",P20*Liquidazione!$W$39,0)","v":0},{"$f":"IF(N20=\"X\",P20*Liquidazione!$X$37,0)","v":0},{"$f":"IF(N20=\"X\",P20*Liquidazione!$X$38,0)","v":0},{"$f":"IF(N20=\"X\",P20*Liquidazione!$X$39,0)","v":0}]
{"$rows_left_out":21}
{"sheet":"Liquidazione","index":1,"n_rows":57,"n_cols":24,"rows_kept":57,"cut":false,"hidden":false,"merged":[[57,1,67,7],[19,0,19,7],[45,0,45,7],[56,0,56,7],[7,0,7,7],[28,0,28,7],[23,0,23,7],[18,0,18,7],[11,0,11,7],[27,0,27,7],[20,0,20,7],[0,0,0,7],[1,0,1,7],[3,0,3,7],[5,0,5,7],[9,0,9,7]]}
["TRIBUNALE DI ROMA"]
["IV SEZIONE CIVILE"]
[]
["ISTANZA DI LIQUIDAZIONE COMPENSI CUSTODE"]
[]
[{"$f":"CONCATENATE(\"Procedura esecutiva nr. \",'Inserimento dati'!D4,\" - Anno \",'Inserimento dati'!F4)","v":"Procedura esecutiva nr.  - Anno "}]
[]
[{"$f":"CONCATENATE(\"Il sottoscritto custode, \",'Inserimento dati'!D8,\" \",'Inserimento dati'!F8,\" \", 'Inserimento dati'!I8,\" codice fiscale \",'Inserimento dati'!F10,\", eMail \",'Inserimento dati'!I10,\" a conclusione dell'incarico conferito nella procedura esecutiva in epigrafe indicata, visti i DD.MM. 80/2009 e 313/1999,\")","v":"Il sottoscritto custode,    codice fiscale , eMail  a conclusione dell'incarico conferito nella procedura esecutiva in epigrafe indicata, visti i DD.MM. 80/2009 e 313/1999,"}]
[]
["CHIEDE"]
[]
["la liquidazione delle competenze maturate e delle spese sostenute per lo svolgimento dell'incarico."]
[]
["A tal fine rappresenta che:"]
[{"$f":"CONCATENATE(\"1) Oggetto della procedura esecutiva sono n. \",O15,\" lotti;\")","v":"1) Oggetto della procedura esecutiva sono n. 0 lotti;"},null,null,null,null,null,null,null,null,null,null,null,null,{"$f":"COUNTBLANK('Inserimento dati'!C20:C39)","v":20},{"$f":"20-N15","v":0}]
[{"$f":"CONCATENATE(\"2) Il valore complessivo del compendio pignorato è pari a euro \")","v":"2) Il valore complessivo del compendio pignorato è pari a euro "},null,null,null,null,null,{"$f":"O16","v":0},null,null,null,null,null,null,null,{"$f":"SUM('Inserimento dati'!C20:C39)","v":0}]
["3) L'importo complessivo dei frutti civili percepiti è pari a euro",null,null,null,null,null,{"$f":"O17","v":0},null,null,null,null,null,null,null,{"$f":"'Inserimento dati'!H14","v":0}]
[]
["Rileva, altresì, che si sono verificate le seguenti ipotesi espressamente disiciplinate dal D.M. 80/2009:"]
[{"$f":"CONCATENATE(\"A) L'incarico aveva ad oggetto beni liberi o ha presentanto profili di ridotta complessità per n.\",O20,\" \",P20,\";\")","v":"A) L'incarico aveva ad oggetto beni liberi o ha presentanto profili di ridotta complessità per n.0 lotti;"},null,null,null,null,null,null,null,null,null,null,null,null,{"$f":"COUNTBLANK('Inserimento dati'!D20:D39)","v":20},{"$f":"20-N20","v":0},{"$f":"IF(O20=1,\"lotto\",\"lotti\")","v":"lotti"}]
{"$rows_left_out":38}
{"sheet":"Tabelle","index":2,"n_rows":41,"n_cols":8,"rows_kept":41,"cut":false,"hidden":true,"merged":[[37,1,37,2],[38,1,38,2],[39,1,39,2],[40,1,40,2],[36,1,36,2]]}
[]
[null,"Titolo"]
[null,"Avvocato"]
[null,"Comm.sta"]
[null,"Altro"]
[]
[null,"Scaglioni compenso su valore immobili"]
[null,"Da","A","Perc.","Max scag.prec."]
[null,0,25000,0.03,0]
[null,25000.01,100000,0.01,750,null,null,{"$f":"75000*D10","v":750}]
[null,100000.01,200000,8.0000000000000002E-3,1500]
[null,200000.01,300000,7.0000000000000001E-3,2300,null,null,{"$f":"64000/100*0.7","v":448}]
[null,300000.01,500000,5.0000000000000001E-3,3000]
[null,500000.01,0,3.0000000000000001E-3,4000]
[]
[null,"Scaglioni compenso su riscossione frutti civili"]
[null,"Da","A","Perc.","Max scag.prec."]
[null,0,5000,0.04]
[null,5000.01,0,0.03,200]
[]
{"$rows_left_out":21}